Reaction Details
TargetPleiotropic ABC efflux transporter of multiple drugs
LigandBDBM78436
Substrate/Competitorn/a
Meas. Tech.ChEMBL_730212 (CHEMBL1696307)
IC50 2300±n/a nM
Citation Kolaczkowski, MKolaczkowska, AMotohashi, NMichalak, K New high-throughput screening assay to reveal similarities and differences in inhibitory sensitivities of multidrug ATP-binding cassette transporters. Antimicrob Agents Chemother53:1516-27 (2009) 
 
Pleiotropic ABC efflux transporter of multiple drugs
Name:Pleiotropic ABC efflux transporter of multiple drugs
Type:PROTEIN
Mol. Mass.:170453.87
Organism:Saccharomyces cerevisiae S288c
Description:ChEMBL_730212
Residue:1511
BDBM78436
NameBDBM78436
Synonyms:2-(ethylthio)-10-[3-(4-methyl-1-piperazinyl)propyl]phenothiazine;2-hydroxybutanedioic acid 2-ethylsulfanyl-10-[3-(4-methylpiperazin-1-yl)propyl]phenothiazine;2-hydroxybutanedioic acid MLS002154140 THIETHYLPERAZINE cid_3085006 | med.21724, Compound Thiethylperazine
TypeSmall organic molecule
Emp. Form.C22H29N3S2
Mol. Mass.399.616
SMILESCCSc1ccc2Sc3ccccc3N(CCCN3CCN(C)CC3)c2c1