Reaction Details
TargetMannosyl-oligosaccharide alpha-1,2-mannosidase IA
LigandBDBM50339274
Substrate/Competitorn/a
Meas. Tech.ChEMBL_736246 (CHEMBL1693390)
IC50 1500000±n/a nM
Citation Poláková, MŠeták, SLattová, EPetruš, LMucha, JTvaroška, IKóna, J a-D-mannose derivatives as models designed for selective inhibition of Golgia-mannosidase II. Eur J Med Chem46:944-52 (2011) 
 
Mannosyl-oligosaccharide alpha-1,2-mannosidase IA
Name:Mannosyl-oligosaccharide alpha-1,2-mannosidase IA
Type:PROTEIN
Mol. Mass.:74961.37
Organism:Drosophila melanogaster
Description:ChEMBL_103952
Residue:667
BDBM50339274
NameBDBM50339274
Synonyms:2-Phenylethyl alpha-D-mannopyranosyl sulfone | CHEMBL1689636
TypeSmall organic molecule
Emp. Form.C14H20O7S
Mol. Mass.332.369
SMILESOC[C@H]1O[C@@H]([C@@H](O)[C@@H](O)[C@@H]1O)S(=O)(=O)CCc1ccccc1