Reaction Details
TargetKappa-type opioid receptor
LigandBDBM50341305
Substrate/Competitorn/a
Meas. Tech.ChEMBL_742584 (CHEMBL1769427)
EC50 89±n/a nM
Citation Zhang, TYan, ZSromek, AKnapp, BIScrimale, TBidlack, JMNeumeyer, JL Aminothiazolomorphinans with mixed¿ andµ opioid activity. J Med Chem54:1903-13 (2011) 
 
Kappa-type opioid receptor
Name:Kappa-type opioid receptor
Type:G Protein-Coupled Receptor (GPCR)
Mol. Mass.:42648.76
Organism:Homo sapiens (Human)
Description:P41145
Residue:380
BDBM50341305
NameBDBM50341305
Synonyms:CHEMBL1766043 | N'-Ethyl-aminothiazolo[5,4-b]-N-fluoropropylmorphinan
TypeSmall organic molecule
Emp. Form.C22H30FN3S
Mol. Mass.387.557
SMILESCCNc1nc2cc3c(C[C@@H]4[C@@H]5CCCC[C@]35CCN4CCCF)cc2s1