Reaction Details
TargetDelta-type opioid receptor
LigandBDBM50341304
Substrate/Competitorn/a
Meas. Tech.ChEMBL_742587 (CHEMBL1769430)
Ki 220±n/a nM
Citation Zhang, TYan, ZSromek, AKnapp, BIScrimale, TBidlack, JMNeumeyer, JL Aminothiazolomorphinans with mixed¿ andµ opioid activity. J Med Chem54:1903-13 (2011) 
 
Delta-type opioid receptor
Name:Delta-type opioid receptor
Type:G Protein-Coupled Receptor (GPCR)
Mol. Mass.:40382.98
Organism:Homo sapiens (Human)
Description:Competition binding assays were carried out using membrane preparations from transfected HN9.10 cells that constitutively expressed the delta opioid receptor.
Residue:372
BDBM50341304
NameBDBM50341304
Synonyms:CHEMBL1766042 | N'-Acetyl-aminothiazolo[5,4-b]-N-fluoropropylmorphinan
TypeSmall organic molecule
Emp. Form.C22H28FN3OS
Mol. Mass.401.541
SMILESCC(=O)Nc1nc2cc3c(C[C@@H]4[C@@H]5CCCC[C@]35CCN4CCCF)cc2s1