Reaction Details
TargetDelta-type opioid receptor
LigandBDBM50341302
Substrate/Competitorn/a
Meas. Tech.ChEMBL_742587 (CHEMBL1769430)
Ki 91±n/a nM
Citation Zhang, TYan, ZSromek, AKnapp, BIScrimale, TBidlack, JMNeumeyer, JL Aminothiazolomorphinans with mixed¿ andµ opioid activity. J Med Chem54:1903-13 (2011) 
 
Delta-type opioid receptor
Name:Delta-type opioid receptor
Type:G Protein-Coupled Receptor (GPCR)
Mol. Mass.:40382.98
Organism:Homo sapiens (Human)
Description:Competition binding assays were carried out using membrane preparations from transfected HN9.10 cells that constitutively expressed the delta opioid receptor.
Residue:372
BDBM50341302
NameBDBM50341302
Synonyms:CHEMBL1766040 | N'-Ethyl-aminothiazolo[5,4-b]-N-cyclobutylmethylmorphinan
TypeSmall organic molecule
Emp. Form.C24H33N3S
Mol. Mass.395.604
SMILESCCNc1nc2cc3c(C[C@@H]4[C@@H]5CCCC[C@]35CCN4CC3CCC3)cc2s1