Reaction Details
TargetMu-type opioid receptor
LigandBDBM50341296
Substrate/Competitorn/a
Meas. Tech.ChEMBL_742590 (CHEMBL1769433)
Ki 610±n/a nM
Citation Zhang, TYan, ZSromek, AKnapp, BIScrimale, TBidlack, JMNeumeyer, JL Aminothiazolomorphinans with mixed¿ andµ opioid activity. J Med Chem54:1903-13 (2011) 
 
Mu-type opioid receptor
Name:Mu-type opioid receptor
Type:G Protein-Coupled Receptor (GPCR)
Mol. Mass.:44789.51
Organism:Homo sapiens (Human)
Description:P35372
Residue:400
BDBM50341296
NameBDBM50341296
Synonyms:CHEMBL1766034 | N'-(Pyridin-2-yl)-aminothiazolo[5,4-b]-N-cyclopropylmethylmorphinan
TypeSmall organic molecule
Emp. Form.C26H30N4S
Mol. Mass.430.608
SMILESC(C1CC1)N1CC[C@]23CCCC[C@H]2[C@H]1Cc1cc2sc(Nc4ccccn4)nc2cc31