Reaction Details
TargetMu-type opioid receptor
LigandBDBM50341300
Substrate/Competitorn/a
Meas. Tech.ChEMBL_742590 (CHEMBL1769433)
Ki 86±n/a nM
Citation Zhang, TYan, ZSromek, AKnapp, BIScrimale, TBidlack, JMNeumeyer, JL Aminothiazolomorphinans with mixed¿ andµ opioid activity. J Med Chem54:1903-13 (2011) 
 
Mu-type opioid receptor
Name:Mu-type opioid receptor
Type:G Protein-Coupled Receptor (GPCR)
Mol. Mass.:44789.51
Organism:Homo sapiens (Human)
Description:P35372
Residue:400
BDBM50341300
NameBDBM50341300
Synonyms:CHEMBL1766038 | N'-Acetyl-N'-ethyl-amino-thiazolo[5,4-b]-Ncyclopropylmethyl-morphinan
TypeSmall organic molecule
Emp. Form.C25H33N3OS
Mol. Mass.423.614
SMILESCCN(C(C)=O)c1nc2cc3c(C[C@@H]4[C@@H]5CCCC[C@]35CCN4CC3CC3)cc2s1