Reaction Details
TargetMu-type opioid receptor
LigandBDBM50341301
Substrate/Competitorn/a
Meas. Tech.ChEMBL_742590 (CHEMBL1769433)
Ki 1.8±n/a nM
Citation Zhang, TYan, ZSromek, AKnapp, BIScrimale, TBidlack, JMNeumeyer, JL Aminothiazolomorphinans with mixed¿ andµ opioid activity. J Med Chem54:1903-13 (2011) 
 
Mu-type opioid receptor
Name:Mu-type opioid receptor
Type:G Protein-Coupled Receptor (GPCR)
Mol. Mass.:44789.51
Organism:Homo sapiens (Human)
Description:P35372
Residue:400
BDBM50341301
NameBDBM50341301
Synonyms:CHEMBL1766039 | N'-Methyl-aminothiazolo[5,4-b]-N-cyclobutylmethylmorphinan
TypeSmall organic molecule
Emp. Form.C23H31N3S
Mol. Mass.381.577
SMILESCNc1nc2cc3c(C[C@@H]4[C@@H]5CCCC[C@]35CCN4CC3CCC3)cc2s1