Reaction Details
TargetMu-type opioid receptor
LigandBDBM50341286
Substrate/Competitorn/a
Meas. Tech.ChEMBL_742590 (CHEMBL1769433)
EC50 47±n/a nM
Citation Zhang, TYan, ZSromek, AKnapp, BIScrimale, TBidlack, JMNeumeyer, JL Aminothiazolomorphinans with mixed¿ andµ opioid activity. J Med Chem54:1903-13 (2011) 
 
Mu-type opioid receptor
Name:Mu-type opioid receptor
Type:G Protein-Coupled Receptor (GPCR)
Mol. Mass.:44789.51
Organism:Homo sapiens (Human)
Description:P35372
Residue:400
BDBM50341286
NameBDBM50341286
Synonyms:CHEMBL1766024 | N'-Methylaminothiazolo[5,4-b]-N-cyclopropylmethylmorphinan
TypeSmall organic molecule
Emp. Form.C22H29N3S
Mol. Mass.367.551
SMILESCNc1nc2cc3c(C[C@@H]4[C@@H]5CCCC[C@]35CCN4CC3CC3)cc2s1