Reaction Details
TargetKappa-type opioid receptor
LigandBDBM50341292
Substrate/Competitorn/a
Meas. Tech.ChEMBL_742583 (CHEMBL1769426)
Ki 2.1±n/a nM
Citation Zhang, TYan, ZSromek, AKnapp, BIScrimale, TBidlack, JMNeumeyer, JL Aminothiazolomorphinans with mixed¿ andµ opioid activity. J Med Chem54:1903-13 (2011) 
 
Kappa-type opioid receptor
Name:Kappa-type opioid receptor
Type:G Protein-Coupled Receptor (GPCR)
Mol. Mass.:42648.76
Organism:Homo sapiens (Human)
Description:P41145
Residue:380
BDBM50341292
NameBDBM50341292
Synonyms:CHEMBL1766030 | N'-Benzyl-aminothiazolo[5,4-b]-N-cyclopropylmethylmorphinan
TypeSmall organic molecule
Emp. Form.C28H33N3S
Mol. Mass.443.647
SMILESC(Nc1nc2cc3c(C[C@@H]4[C@@H]5CCCC[C@]35CCN4CC3CC3)cc2s1)c1ccccc1