Reaction Details
TargetKappa-type opioid receptor
LigandBDBM50341297
Substrate/Competitorn/a
Meas. Tech.ChEMBL_742583 (CHEMBL1769426)
Ki 110±n/a nM
Citation Zhang, TYan, ZSromek, AKnapp, BIScrimale, TBidlack, JMNeumeyer, JL Aminothiazolomorphinans with mixed¿ andµ opioid activity. J Med Chem54:1903-13 (2011) 
 
Kappa-type opioid receptor
Name:Kappa-type opioid receptor
Type:G Protein-Coupled Receptor (GPCR)
Mol. Mass.:42648.76
Organism:Homo sapiens (Human)
Description:P41145
Residue:380
BDBM50341297
NameBDBM50341297
Synonyms:CHEMBL1766035 | N'-(Piperazin-1-yl)-thiazolo[5,4-b]-N-cyclopropylmethylmorphinan
TypeSmall organic molecule
Emp. Form.C25H35N5S
Mol. Mass.437.644
SMILESC(C1CC1)N1CC[C@]23CCCC[C@H]2[C@H]1Cc1cc2sc(NN4CCNCC4)nc2cc31