Reaction Details
TargetKappa-type opioid receptor
LigandBDBM50341284
Substrate/Competitorn/a
Meas. Tech.ChEMBL_742583 (CHEMBL1769426)
EC50 32±n/a nM
Citation Zhang, TYan, ZSromek, AKnapp, BIScrimale, TBidlack, JMNeumeyer, JL Aminothiazolomorphinans with mixed¿ andµ opioid activity. J Med Chem54:1903-13 (2011) 
 
Kappa-type opioid receptor
Name:Kappa-type opioid receptor
Type:G Protein-Coupled Receptor (GPCR)
Mol. Mass.:42648.76
Organism:Homo sapiens (Human)
Description:P41145
Residue:380
BDBM50341284
NameBDBM50341284
Synonyms:Aminothiazolo[5,4-b]-N-fluoropropylmorphinan | CHEMBL1766022
TypeSmall organic molecule
Emp. Form.C20H26FN3S
Mol. Mass.359.504
SMILESNc1nc2cc3c(C[C@@H]4[C@@H]5CCCC[C@]35CCN4CCCF)cc2s1