Reaction Details
TargetOrotidine 5'-phosphate decarboxylase
LigandBDBM50341908
Substrate/Competitorn/a
Meas. Tech.ChEMBL_743288 (CHEMBL1767487)
Ki 630±n/a nM
Citation Lewis, MMeza-Avina, MEWei, LCrandall, IEBello, AMPoduch, ELiu, YPaige, CJKain, KCPai, EFKotra, LP Novel interactions of fluorinated nucleotide derivatives targeting orotidine 5'-monophosphate decarboxylase. J Med Chem54:2891-901 (2011) 
 
Orotidine 5'-phosphate decarboxylase
Name:Orotidine 5'-phosphate decarboxylase
Type:Enzyme
Mol. Mass.:24909.45
Organism:Methanobacterium thermoautotrophicum
Description:n/a
Residue:228
BDBM50341908
NameBDBM50341908
Synonyms:((2S,3S,4R,5R)-5-(5-azido-2,4-dioxo-3,4-dihydropyrimidin-1(2H)-yl)-3,4-dihydroxytetrahydrofuran-2-yl)methylphosphonate | CHEMBL1765125
TypeSmall organic molecule
Emp. Form.C9H12N5O8P
Mol. Mass.349.194
SMILESO[C@@H]1[C@@H](CP(O)(O)=O)O[C@H]([C@@H]1O)n1cc(N=[N+]=[N-])c(=O)[nH]c1=O