Reaction Details
TargetUridine 5'-monophosphate synthase
LigandBDBM50341905
Substrate/Competitorn/a
Meas. Tech.ChEMBL_743290 (CHEMBL1767489)
Ki>2000000±n/a nM
Citation Lewis, MMeza-Avina, MEWei, LCrandall, IEBello, AMPoduch, ELiu, YPaige, CJKain, KCPai, EFKotra, LP Novel interactions of fluorinated nucleotide derivatives targeting orotidine 5'-monophosphate decarboxylase. J Med Chem54:2891-901 (2011) 
 
Uridine 5'-monophosphate synthase
Name:Uridine 5'-monophosphate synthase
Type:Enzyme
Mol. Mass.:52224.99
Organism:Homo sapiens (Human)
Description:P11172
Residue:480
BDBM50341905
NameBDBM50341905
Synonyms:CHEMBL1765124 | ammonium 6-Cyano-2'-deoxy-2'-fluoro-beta-D-uridine 5'-O-Monophosphate
TypeSmall organic molecule
Emp. Form.C10H9FN3O7P
Mol. Mass.333.1676
SMILESO[C@@H]1[C@@H](CP([O-])([O-])=O)O[C@H]([C@@H]1F)n1c(cc(=O)[nH]c1=O)C#N