Reaction Details
TargetUridine 5'-monophosphate synthase
LigandBDBM50341906
Substrate/Competitorn/a
Meas. Tech.ChEMBL_743290 (CHEMBL1767489)
Ki>4000000±n/a nM
Citation Lewis, MMeza-Avina, MEWei, LCrandall, IEBello, AMPoduch, ELiu, YPaige, CJKain, KCPai, EFKotra, LP Novel interactions of fluorinated nucleotide derivatives targeting orotidine 5'-monophosphate decarboxylase. J Med Chem54:2891-901 (2011) 
 
Uridine 5'-monophosphate synthase
Name:Uridine 5'-monophosphate synthase
Type:Enzyme
Mol. Mass.:52224.99
Organism:Homo sapiens (Human)
Description:P11172
Residue:480
BDBM50341906
NameBDBM50341906
Synonyms:Ammonium 6-Amido-2'-deoxy-2'-fluoro-beta-D-uridine 5'-O-Monophosphate | CHEMBL1765121
TypeSmall organic molecule
Emp. Form.C10H11FN3O8P
Mol. Mass.351.1829
SMILESNC(=O)c1cc(=O)[nH]c(=O)n1[C@@H]1O[C@H](CP([O-])([O-])=O)[C@@H](O)[C@H]1F