Reaction Details
TargetCannabinoid receptor 1
LigandBDBM50342054
Substrate/Competitorn/a
Meas. Tech.ChEMBL_743739 (CHEMBL1767553)
Ki>10000±n/a nM
Citation Donohue, SRDannals, RFHalldin, CPike, VW N-(4-cyanotetrahydro-2H-pyran-4-yl) and N-(1-cyanocyclohexyl) derivatives of 1,5-diarylpyrazole-3-carboxamides showing high affinity for 18 kDa translocator protein and/or cannabinoid receptors. J Med Chem54:2961-70 (2011) 
 
Cannabinoid receptor 1
Name:Cannabinoid receptor 1
Type:G Protein-Coupled Receptor (GPCR)
Mol. Mass.:52868.96
Organism:Homo sapiens (Human)
Description:P21554
Residue:472
BDBM50342054
NameBDBM50342054
Synonyms:CHEMBL1765680 | N-(4-Cyanotetrahydro-2H-pyran-4-yl)-1-(2-iodophenyl)-4-methyl-5-phenyl-1H-pyrazole-3-carboxamide
TypeSmall organic molecule
Emp. Form.C23H21IN4O2
Mol. Mass.512.3429
SMILESCc1c(nn(c1-c1ccccc1)-c1ccccc1I)C(=O)NC1(CCOCC1)C#N