Reaction Details
TargetCannabinoid receptor 2
LigandBDBM50342046
Substrate/Competitorn/a
Meas. Tech.ChEMBL_743740 (CHEMBL1767554)
Ki>10000±n/a nM
Citation Donohue, SRDannals, RFHalldin, CPike, VW N-(4-cyanotetrahydro-2H-pyran-4-yl) and N-(1-cyanocyclohexyl) derivatives of 1,5-diarylpyrazole-3-carboxamides showing high affinity for 18 kDa translocator protein and/or cannabinoid receptors. J Med Chem54:2961-70 (2011) 
 
Cannabinoid receptor 2
Name:Cannabinoid receptor 2
Type:G Protein-Coupled Receptor (GPCR)
Mol. Mass.:39690.94
Organism:Homo sapiens (Human)
Description:P34972
Residue:360
BDBM50342046
NameBDBM50342046
Synonyms:1-(2-Bromophenyl)-N-(4-cyanotetrahydro-2H-pyran-4-yl)-5-phenyl-1H-pyrazole-3-carboxamide | CHEMBL1765672
TypeSmall organic molecule
Emp. Form.C22H19BrN4O2
Mol. Mass.451.316
SMILESBrc1ccccc1-n1nc(cc1-c1ccccc1)C(=O)NC1(CCOCC1)C#N