Reaction Details
TargetCannabinoid receptor 1
LigandBDBM50217216
Substrate/Competitorn/a
Meas. Tech.ChEMBL_743739 (CHEMBL1767553)
IC50 0.7±n/a nM
Citation Donohue, SRDannals, RFHalldin, CPike, VW N-(4-cyanotetrahydro-2H-pyran-4-yl) and N-(1-cyanocyclohexyl) derivatives of 1,5-diarylpyrazole-3-carboxamides showing high affinity for 18 kDa translocator protein and/or cannabinoid receptors. J Med Chem54:2961-70 (2011) 
 
Cannabinoid receptor 1
Name:Cannabinoid receptor 1
Type:G Protein-Coupled Receptor (GPCR)
Mol. Mass.:52868.96
Organism:Homo sapiens (Human)
Description:P21554
Residue:472
BDBM50217216
NameBDBM50217216
Synonyms:CHEMBL226591 N-{(1S,2S)-2-(3-cyanophenyl)-3-[4-(2-fluoroethoxy)phenyl)]-1-methylpropyl}-2-methyl-2-[(5-methylpyridin-2-yl)oxy]propanamide
TypeSmall organic molecule
Emp. Form.C29H32FN3O3
Mol. Mass.489.5811
SMILESC[C@H](NC(=O)C(C)(C)Oc1ccc(C)cn1)[C@@H](Cc1ccc(OCCF)cc1)c1cccc(c1)C#N