Reaction Details
TargetCannabinoid receptor 1
LigandBDBM50342039
Substrate/Competitorn/a
Meas. Tech.ChEMBL_743739 (CHEMBL1767553)
Ki 55±n/a nM
Citation Donohue, SRDannals, RFHalldin, CPike, VW N-(4-cyanotetrahydro-2H-pyran-4-yl) and N-(1-cyanocyclohexyl) derivatives of 1,5-diarylpyrazole-3-carboxamides showing high affinity for 18 kDa translocator protein and/or cannabinoid receptors. J Med Chem54:2961-70 (2011) 
 
Cannabinoid receptor 1
Name:Cannabinoid receptor 1
Type:G Protein-Coupled Receptor (GPCR)
Mol. Mass.:52868.96
Organism:Homo sapiens (Human)
Description:P21554
Residue:472
BDBM50342039
NameBDBM50342039
Synonyms:1-(2-Bromophenyl)-N-(4-cyanotetrahydro-2H-pyran-4-yl)-5-(4-fluorophenyl)-4-methyl-1H-pyrazole-3-carboxamide | CHEMBL1765820
TypeSmall organic molecule
Emp. Form.C23H20BrFN4O2
Mol. Mass.483.333
SMILESCc1c(nn(c1-c1ccc(F)cc1)-c1ccccc1Br)C(=O)NC1(CCOCC1)C#N