Reaction Details
TargetCannabinoid receptor 1
LigandBDBM50342049
Substrate/Competitorn/a
Meas. Tech.ChEMBL_743739 (CHEMBL1767553)
Ki 500±n/a nM
Citation Donohue, SRDannals, RFHalldin, CPike, VW N-(4-cyanotetrahydro-2H-pyran-4-yl) and N-(1-cyanocyclohexyl) derivatives of 1,5-diarylpyrazole-3-carboxamides showing high affinity for 18 kDa translocator protein and/or cannabinoid receptors. J Med Chem54:2961-70 (2011) 
 
Cannabinoid receptor 1
Name:Cannabinoid receptor 1
Type:G Protein-Coupled Receptor (GPCR)
Mol. Mass.:52868.96
Organism:Homo sapiens (Human)
Description:P21554
Residue:472
BDBM50342049
NameBDBM50342049
Synonyms:CHEMBL1765681 | N-(4-Cyanotetrahydro-2H-pyran-4-yl)-1-(2-phenylphenyl)-4-methyl-5-phenyl-1H-pyrazole-3-carboxamide
TypeSmall organic molecule
Emp. Form.C29H26N4O2
Mol. Mass.462.5423
SMILESCc1c(nn(c1-c1ccccc1)-c1ccccc1-c1ccccc1)C(=O)NC1(CCOCC1)C#N