Reaction Details
TargetTYR_PHOSPHATASE_2 domain-containing protein
LigandBDBM50343149
Substrate/Competitorn/a
Meas. Tech.ChEMBL_745246 (CHEMBL1775840)
IC50 17500±n/a nM
Citation Chen, LZhou, BZhang, SWu, LWang, YFranzblau, SGZhang, ZY Identification and characterization of novel inhibitors of mPTPB, an essential virulent phosphatase from Mycobacterium tuberculosis. ACS Med Chem Lett1:355-359 (2010) 
 
TYR_PHOSPHATASE_2 domain-containing protein
Name:TYR_PHOSPHATASE_2 domain-containing protein
Type:Hydrolase
Mol. Mass.:30152.45
Organism:Mycobacterium tuberculosis
Description:n/a
Residue:276
BDBM50343149
NameBDBM50343149
Synonyms:CHEMBL1773182 | N1-(2-(1H-indol-3-yl)ethyl)-N2-(1-(4-(4-fluorophenyl)piperazin-1-yl)-1-(thiophen-2-yl)propan-2-yl)oxalamide
TypeSmall organic molecule
Emp. Form.C29H32FN5O2S
Mol. Mass.533.66
SMILESCC(NC(=O)C(=O)NCCc1c[nH]c2ccccc12)C(N1CCN(CC1)c1ccc(F)cc1)c1cccs1