Reaction Details
TargetTYR_PHOSPHATASE_2 domain-containing protein
LigandBDBM50343150
Substrate/Competitorn/a
Meas. Tech.ChEMBL_745275 (CHEMBL1775307)
IC50 11400±n/a nM
Citation Chen, LZhou, BZhang, SWu, LWang, YFranzblau, SGZhang, ZY Identification and characterization of novel inhibitors of mPTPB, an essential virulent phosphatase from Mycobacterium tuberculosis. ACS Med Chem Lett1:355-359 (2010) 
 
TYR_PHOSPHATASE_2 domain-containing protein
Name:TYR_PHOSPHATASE_2 domain-containing protein
Type:Hydrolase
Mol. Mass.:30152.45
Organism:Mycobacterium tuberculosis
Description:n/a
Residue:276
BDBM50343150
NameBDBM50343150
Synonyms:CHEMBL1773183 | N1-(1-(4-(4-fluorophenyl)piperazin-1-yl)-1-(thiophen-2-yl)propan-2-yl)-N2-(2-methoxybenzyl)oxalamide
TypeSmall organic molecule
Emp. Form.C27H31FN4O3S
Mol. Mass.510.623
SMILESCOc1ccccc1CNC(=O)C(=O)NC(C)C(N1CCN(CC1)c1ccc(F)cc1)c1cccs1