Reaction Details
TargetTYR_PHOSPHATASE_2 domain-containing protein
LigandBDBM50343142
Substrate/Competitorn/a
Meas. Tech.ChEMBL_745246 (CHEMBL1775840)
IC50 1400±n/a nM
Citation Chen, LZhou, BZhang, SWu, LWang, YFranzblau, SGZhang, ZY Identification and characterization of novel inhibitors of mPTPB, an essential virulent phosphatase from Mycobacterium tuberculosis. ACS Med Chem Lett1:355-359 (2010) 
 
TYR_PHOSPHATASE_2 domain-containing protein
Name:TYR_PHOSPHATASE_2 domain-containing protein
Type:Hydrolase
Mol. Mass.:30152.45
Organism:Mycobacterium tuberculosis
Description:n/a
Residue:276
BDBM50343142
NameBDBM50343142
Synonyms:CHEMBL1773168 | N-(4-butylphenyl)-2-oxo-1,2-dihydrobenzo[cd]indole-6-sulfonamide
TypeSmall organic molecule
Emp. Form.C21H20N2O3S
Mol. Mass.380.46
SMILESCCCCc1ccc(NS(=O)(=O)c2ccc3NC(=O)c4cccc2c34)cc1