Reaction Details
TargetTYR_PHOSPHATASE_2 domain-containing protein
LigandBDBM50343143
Substrate/Competitorn/a
Meas. Tech.ChEMBL_745246 (CHEMBL1775840)
IC50 10800±n/a nM
Citation Chen, LZhou, BZhang, SWu, LWang, YFranzblau, SGZhang, ZY Identification and characterization of novel inhibitors of mPTPB, an essential virulent phosphatase from Mycobacterium tuberculosis. ACS Med Chem Lett1:355-359 (2010) 
 
TYR_PHOSPHATASE_2 domain-containing protein
Name:TYR_PHOSPHATASE_2 domain-containing protein
Type:Hydrolase
Mol. Mass.:30152.45
Organism:Mycobacterium tuberculosis
Description:n/a
Residue:276
BDBM50343143
NameBDBM50343143
Synonyms:2-oxo-N-(6,7,8,9-tetrahydrodibenzo[b,d]furan-2-yl)-1,2-dihydrobenzo[cd]indole-6-sulfonamide | CHEMBL1773169
TypeSmall organic molecule
Emp. Form.C23H18N2O4S
Mol. Mass.418.465
SMILESO=C1Nc2ccc(c3cccc1c23)S(=O)(=O)Nc1ccc2oc3CCCCc3c2c1