Reaction Details
TargetTYR_PHOSPHATASE_2 domain-containing protein
LigandBDBM50343145
Substrate/Competitorn/a
Meas. Tech.ChEMBL_745246 (CHEMBL1775840)
IC50 22800±n/a nM
Citation Chen, LZhou, BZhang, SWu, LWang, YFranzblau, SGZhang, ZY Identification and characterization of novel inhibitors of mPTPB, an essential virulent phosphatase from Mycobacterium tuberculosis. ACS Med Chem Lett1:355-359 (2010) 
 
TYR_PHOSPHATASE_2 domain-containing protein
Name:TYR_PHOSPHATASE_2 domain-containing protein
Type:Hydrolase
Mol. Mass.:30152.45
Organism:Mycobacterium tuberculosis
Description:n/a
Residue:276
BDBM50343145
NameBDBM50343145
Synonyms:CHEMBL1773171 | heptyl 2-methyl-5-(2-oxo-1,2-dihydrobenzo[cd]indole-6-sulfonamido)benzofuran-3-carboxylate
TypeSmall organic molecule
Emp. Form.C28H28N2O6S
Mol. Mass.520.597
SMILESCCCCCCCOC(=O)c1c(C)oc2ccc(NS(=O)(=O)c3ccc4NC(=O)c5cccc3c45)cc12