Reaction Details
TargetDual specificity protein phosphatase CDC14A
LigandBDBM50343147
Substrate/Competitorn/a
Meas. Tech.ChEMBL_745330 (CHEMBL1775405)
IC50>50000±n/a nM
Citation Chen, LZhou, BZhang, SWu, LWang, YFranzblau, SGZhang, ZY Identification and characterization of novel inhibitors of mPTPB, an essential virulent phosphatase from Mycobacterium tuberculosis. ACS Med Chem Lett1:355-359 (2010) 
 
Dual specificity protein phosphatase CDC14A
Name:Dual specificity protein phosphatase CDC14A
Type:n/a
Mol. Mass.:66598.40
Organism:Homo sapiens (Human)
Description:Q9UNH5
Residue:594
BDBM50343147
NameBDBM50343147
Synonyms:CHEMBL1773180 | N1-(furan-2-ylmethyl)-N2-(1-(4-(4-methoxyphenyl)piperazin-1-yl)-1-(thiophen-2-yl)propan-2-yl)oxalamide
TypeSmall organic molecule
Emp. Form.C25H30N4O4S
Mol. Mass.482.595
SMILESCOc1ccc(cc1)N1CCN(CC1)C(C(C)NC(=O)C(=O)NCc1ccco1)c1cccs1