Reaction Details
TargetCytochrome P450 3A4
LigandBDBM50343358
Substrate/Competitorn/a
Meas. Tech.ChEMBL_746947 (CHEMBL1777313)
IC50 1400±n/a nM
Citation Zehnder, LBennett, MMeng, JHuang, BNinkovic, SWang, FBraganza, JTatlock, JJewell, TZhou, JZBurke, BWang, JMaegley, KMehta, PPYin, MJGajiwala, KSHickey, MJYamazaki, SSmith, EKang, PSistla, ADovalsantos, EGehring, MRKania, RWythes, MKung, PP Optimization of potent, selective, and orally bioavailable pyrrolodinopyrimidine-containing inhibitors of heat shock protein 90. Identification of development candidate 2-amino-4-{4-chloro-2-[2-(4-fluoro-1H-pyrazol-1-yl)ethoxy]-6-methylphenyl}-N-(2,2-difluoropropyl)-5,7-dihydro-6H-pyrrolo[3,4-d]pyr J Med Chem54:3368-85 (2011) 
 
Cytochrome P450 3A4
Name:Cytochrome P450 3A4
Type:Enzyme
Mol. Mass.:57349.57
Organism:Homo sapiens (Human)
Description:n/a
Residue:503
BDBM50343358
NameBDBM50343358
Synonyms:2-Amino-4-{4-chloro-2-[2-(4-fluoropyrazol-1-yl)ethoxy]-6-methylphenyl}-5,7-dihydropyrrolo[3,4-d]pyrimidine-6-carboxylic Acid(2,2,2-Trifluoroethyl)amide | CHEMBL1774931
TypeSmall organic molecule
Emp. Form.C21H20ClF4N7O2
Mol. Mass.513.876
SMILESCc1cc(Cl)cc(OCCn2cc(F)cn2)c1-c1nc(N)nc2CN(Cc12)C(=O)NCC(F)(F)F