Reaction Details
TargetHeat shock protein HSP 90-alpha
LigandBDBM50343360
Substrate/Competitorn/a
Meas. Tech.ChEMBL_746939 (CHEMBL1777305)
Ki 1200±n/a nM
Citation Zehnder, LBennett, MMeng, JHuang, BNinkovic, SWang, FBraganza, JTatlock, JJewell, TZhou, JZBurke, BWang, JMaegley, KMehta, PPYin, MJGajiwala, KSHickey, MJYamazaki, SSmith, EKang, PSistla, ADovalsantos, EGehring, MRKania, RWythes, MKung, PP Optimization of potent, selective, and orally bioavailable pyrrolodinopyrimidine-containing inhibitors of heat shock protein 90. Identification of development candidate 2-amino-4-{4-chloro-2-[2-(4-fluoro-1H-pyrazol-1-yl)ethoxy]-6-methylphenyl}-N-(2,2-difluoropropyl)-5,7-dihydro-6H-pyrrolo[3,4-d]pyr J Med Chem54:3368-85 (2011) 
 
Heat shock protein HSP 90-alpha
Name:Heat shock protein HSP 90-alpha
Type:Molecular Chaperone
Mol. Mass.:84623.45
Organism:Homo sapiens (Human)
Description:P07900
Residue:732
BDBM50343360
NameBDBM50343360
Synonyms:4-Chloro-6-(2-methoxyphenyl)-pyrimidin-2-ylamine CHEMBL1236713
TypeSmall organic molecule
Emp. Form.C11H10ClN3O
Mol. Mass.235.67
SMILESCOc1ccccc1-c1cc(Cl)nc(N)n1