Reaction Details
TargetHeat shock protein HSP 90-alpha
LigandBDBM50343367
Substrate/Competitorn/a
Meas. Tech.ChEMBL_746939 (CHEMBL1777305)
Ki 38±n/a nM
Citation Zehnder, LBennett, MMeng, JHuang, BNinkovic, SWang, FBraganza, JTatlock, JJewell, TZhou, JZBurke, BWang, JMaegley, KMehta, PPYin, MJGajiwala, KSHickey, MJYamazaki, SSmith, EKang, PSistla, ADovalsantos, EGehring, MRKania, RWythes, MKung, PP Optimization of potent, selective, and orally bioavailable pyrrolodinopyrimidine-containing inhibitors of heat shock protein 90. Identification of development candidate 2-amino-4-{4-chloro-2-[2-(4-fluoro-1H-pyrazol-1-yl)ethoxy]-6-methylphenyl}-N-(2,2-difluoropropyl)-5,7-dihydro-6H-pyrrolo[3,4-d]pyr J Med Chem54:3368-85 (2011) 
 
Heat shock protein HSP 90-alpha
Name:Heat shock protein HSP 90-alpha
Type:Molecular Chaperone
Mol. Mass.:84623.45
Organism:Homo sapiens (Human)
Description:P07900
Residue:732
BDBM50343367
NameBDBM50343367
Synonyms:2-Amino-4-[2,4-dichloro-6-(4,4,4-trifluorobutoxy)phenyl]-5,7-dihydropyrrolo[3,4-d]pyrimidine-6-carboxylic Acid Cyanoethylamide | CHEMBL1774906
TypeSmall organic molecule
Emp. Form.C20H19Cl2F3N6O2
Mol. Mass.503.305
SMILESNc1nc2CN(Cc2c(n1)-c1c(Cl)cc(Cl)cc1OCCCC(F)(F)F)C(=O)NCCC#N