Reaction Details
TargetHeat shock protein HSP 90-alpha
LigandBDBM50343379
Substrate/Competitorn/a
Meas. Tech.ChEMBL_746939 (CHEMBL1777305)
Ki 250±n/a nM
Citation Zehnder, LBennett, MMeng, JHuang, BNinkovic, SWang, FBraganza, JTatlock, JJewell, TZhou, JZBurke, BWang, JMaegley, KMehta, PPYin, MJGajiwala, KSHickey, MJYamazaki, SSmith, EKang, PSistla, ADovalsantos, EGehring, MRKania, RWythes, MKung, PP Optimization of potent, selective, and orally bioavailable pyrrolodinopyrimidine-containing inhibitors of heat shock protein 90. Identification of development candidate 2-amino-4-{4-chloro-2-[2-(4-fluoro-1H-pyrazol-1-yl)ethoxy]-6-methylphenyl}-N-(2,2-difluoropropyl)-5,7-dihydro-6H-pyrrolo[3,4-d]pyr J Med Chem54:3368-85 (2011) 
 
Heat shock protein HSP 90-alpha
Name:Heat shock protein HSP 90-alpha
Type:Molecular Chaperone
Mol. Mass.:84623.45
Organism:Homo sapiens (Human)
Description:P07900
Residue:732
BDBM50343379
NameBDBM50343379
Synonyms:2-Amino-4-[2,4-dichloro-6-(2-ethylamino-ethoxy)-phenyl]-5,7-dihydro-pyrrolo[3,4-d]pyrimidine-6-carboxylic acid cyclobutylamide | CHEMBL1774917
TypeSmall organic molecule
Emp. Form.C21H26Cl2N6O2
Mol. Mass.465.376
SMILESCCNCCOc1cc(Cl)cc(Cl)c1-c1nc(N)nc2CN(Cc12)C(=O)NC1CCC1