Reaction Details
TargetSolute carrier family 22 member 6
LigandBDBM50027886
Substrate/Competitorn/a
Meas. Tech.ChEMBL_749030 (CHEMBL1781815)
Ki 55500±n/a nM
Citation Kouznetsova, VLTsigelny, IFNagle, MANigam, SK Elucidation of common pharmacophores from analysis of targeted metabolites transported by the multispecific drug transporter-Organic anion transporter1 (Oat1). Bioorg Med Chem19:3320-40 (2011) 
 
Solute carrier family 22 member 6
Name:Solute carrier family 22 member 6
Type:PROTEIN
Mol. Mass.:60784.17
Organism:Rattus norvegicus
Description:ChEMBL_838479
Residue:551
BDBM50027886
NameBDBM50027886
Synonyms:1-Butyl-3-(p-methylphenylsulfonyl)urea 1-Butyl-3-tosylurea N-(4-Methylphenylsulfonyl)-N'-butylurea N-Butyl-N'-(p-tolylsulfonyl)urea N-n-Butyl-N'-tosylurea TOLBUTAMIDE
TypeSmall organic molecule
Emp. Form.C12H18N2O3S
Mol. Mass.270.348
SMILESCCCCNC(=O)NS(=O)(=O)c1ccc(C)cc1