Reaction Details
TargetSolute carrier family 22 member 6
LigandBDBM50344967
Substrate/Competitorn/a
Meas. Tech.ChEMBL_749030 (CHEMBL1781815)
Ki 9200±n/a nM
Citation Kouznetsova, VLTsigelny, IFNagle, MANigam, SK Elucidation of common pharmacophores from analysis of targeted metabolites transported by the multispecific drug transporter-Organic anion transporter1 (Oat1). Bioorg Med Chem19:3320-40 (2011) 
 
Solute carrier family 22 member 6
Name:Solute carrier family 22 member 6
Type:PROTEIN
Mol. Mass.:60784.17
Organism:Rattus norvegicus
Description:ChEMBL_838479
Residue:551
BDBM50344967
NameBDBM50344967
Synonyms:2-[(4-Isopropyl-cyclohexanecarbonyl)-amino]-3-phenyl-propionic acid AY-4166 DJN-608 SDZ-DJN-608 | Starlix
TypeSmall organic molecule
Emp. Form.C19H27NO3
Mol. Mass.317.4226
SMILESCC(C)[C@H]1CC[C@@H](CC1)C(=O)N[C@H](Cc1ccccc1)C(O)=O