Reaction Details
TargetMuscarinic acetylcholine receptor M3
LigandBDBM50297134
Substrate/Competitorn/a
Meas. Tech.ChEMBL_750511 (CHEMBL1786272)
IC50 687±n/a nM
Citation Lainé, DIWan, ZYan, HZhu, CXie, HFu, WBusch-Petersen, JNeipp, CDavis, RWiddowson, KLBlaney, FEFoley, JBacon, AMWebb, EFLuttmann, MABurman, MSarau, HMSalmon, MPalovich, MRBelmonte, K Design, synthesis, and structure-activity relationship of tropane muscarinic acetylcholine receptor antagonists. J Med Chem52:5241-52 (2010) 
 
Muscarinic acetylcholine receptor M3
Name:Muscarinic acetylcholine receptor M3
Type:Enzyme
Mol. Mass.:66151.03
Organism:Homo sapiens (Human)
Description:P20309
Residue:590
BDBM50297134
NameBDBM50297134
Synonyms:CHEMBL558919 | endo-3-(8-methyl-8-azabicyclo[3.2.1]octan-3-yl)-2,2-diphenylpropanoic acid
TypeSmall organic molecule
Emp. Form.C23H27NO2
Mol. Mass.349.466
SMILESCN1[C@@H]2CC[C@@H]1CC(CC(C(O)=O)(c1ccccc1)c1ccccc1)C2