Reaction Details
TargetMuscarinic acetylcholine receptor M1
LigandBDBM50345693
Substrate/Competitorn/a
Meas. Tech.ChEMBL_750514 (CHEMBL1786275)
Ki 0.05±n/a nM
Citation Lainé, DIWan, ZYan, HZhu, CXie, HFu, WBusch-Petersen, JNeipp, CDavis, RWiddowson, KLBlaney, FEFoley, JBacon, AMWebb, EFLuttmann, MABurman, MSarau, HMSalmon, MPalovich, MRBelmonte, K Design, synthesis, and structure-activity relationship of tropane muscarinic acetylcholine receptor antagonists. J Med Chem52:5241-52 (2010) 
 
Muscarinic acetylcholine receptor M1
Name:Muscarinic acetylcholine receptor M1
Type:Protein
Mol. Mass.:51442.54
Organism:Homo sapiens (Human)
Description:P11229
Residue:460
BDBM50345693
NameBDBM50345693
Synonyms:(3-endo)-3-(2-Cyano-2,2-diphenylethyl)-8,8-dimethyl-8-azoniabicyclo[3.2.1]octane Bromide CHEMBL558522
TypeSmall organic molecule
Emp. Form.C24H29N2
Mol. Mass.345.4999
SMILESC[N+]1(C)[C@@H]2CC[C@@H]1CC(CC(C#N)(c1ccccc1)c1ccccc1)C2