Reaction Details
TargetMuscarinic acetylcholine receptor M3
LigandBDBM50345690
Substrate/Competitorn/a
Meas. Tech.ChEMBL_750511 (CHEMBL1786272)
IC50 65±n/a nM
Citation Lainé, DIWan, ZYan, HZhu, CXie, HFu, WBusch-Petersen, JNeipp, CDavis, RWiddowson, KLBlaney, FEFoley, JBacon, AMWebb, EFLuttmann, MABurman, MSarau, HMSalmon, MPalovich, MRBelmonte, K Design, synthesis, and structure-activity relationship of tropane muscarinic acetylcholine receptor antagonists. J Med Chem52:5241-52 (2010) 
 
Muscarinic acetylcholine receptor M3
Name:Muscarinic acetylcholine receptor M3
Type:Enzyme
Mol. Mass.:66151.03
Organism:Homo sapiens (Human)
Description:P20309
Residue:590
BDBM50345690
NameBDBM50345690
Synonyms:(3-endo)-3-[2-Hydroxy-2,2-bis(4-methyl-3-thienyl)ethyl]-8,8-dimethyl-8-azoniabicyclo[3.2.1]octane Bromide | CHEMBL1785080
TypeSmall organic molecule
Emp. Form.C21H30NOS2
Mol. Mass.376.598
SMILESCc1cc(cs1)C(O)(CC1C[C@H]2CC[C@H](C1)[N+]2(C)C)c1csc(C)c1