Reaction Details
TargetCalmodulin-domain protein kinase 1
LigandBDBM50345735
Substrate/Competitorn/a
Meas. Tech.ChEMBL_750529 (CHEMBL1786290)
IC50 5±n/a nM
Citation Murphy, RCOjo, KKLarson, ETCastellanos-Gonzalez, APerera, BGKeyloun, KRKim, JEBhandari, JGMuller, NRVerlinde, CLWhite, ACMerritt, EAVan Voorhis, WCMaly, DJ Discovery of Potent and Selective Inhibitors of Calcium-Dependent Protein Kinase 1 (CDPK1) from C. parvum and T. gondii. ACS Med Chem Lett1:331-335 (2011) 
 
Calmodulin-domain protein kinase 1
Name:Calmodulin-domain protein kinase 1
Type:Enzyme Catalytic Domain
Mol. Mass.:57248.42
Organism:Toxoplasma gondii
Description:n/a
Residue:507
BDBM50345735
NameBDBM50345735
Synonyms:1-isopropyl-3-(4-methoxy-3-methylphenyl)-1H-pyrazolo[3,4-d]pyrimidin-4-amine CHEMBL2069943 US11247972, Compound 7m | US9765037, Compound 7m
TypeSmall organic molecule
Emp. Form.C16H19N5O
Mol. Mass.297.355
SMILESCOc1ccc(cc1C)-c1nn(C(C)C)c2ncnc(N)c12