Reaction Details
TargetHepatocyte growth factor receptor
LigandBDBM50346348
Substrate/Competitorn/a
Meas. Tech.ChEMBL_749437 (CHEMBL1786618)
Kd 27.2±n/a nM
Citation Shallal, HMRussu, WA Discovery, synthesis, and investigation of the antitumor activity of novel piperazinylpyrimidine derivatives. Eur J Med Chem46:2043-57 (2011) 
 
Hepatocyte growth factor receptor
Name:Hepatocyte growth factor receptor
Type:Protein
Mol. Mass.:155559.73
Organism:Homo sapiens (Human)
Description:P08581
Residue:1390
BDBM50346348
NameBDBM50346348
Synonyms:CHEMBL1782649
TypeSmall organic molecule
Emp. Form.C24H25N5O5S
Mol. Mass.495.551
SMILESCN(C[C@@H]1COCCO1)S(=O)(=O)Nc1ccc2c(c1)ccc1ncc(cc1c2=O)-c1cnn(C)c1