Reaction Details
TargetDelta-type opioid receptor
LigandBDBM50346953
Substrate/Competitorn/a
Meas. Tech.ChEMBL_753175 (CHEMBL1799268)
Ki 71±n/a nM
Citation Majumdar, SBurgman, MHaselton, NGrinnell, SOcampo, JPasternak, ARPasternak, GW Generation of novel radiolabeled opiates through site-selective iodination. Bioorg Med Chem Lett21:4001-4 (2011) 
 
Delta-type opioid receptor
Name:Delta-type opioid receptor
Type:G Protein-Coupled Receptor (GPCR)
Mol. Mass.:40382.98
Organism:Homo sapiens (Human)
Description:Competition binding assays were carried out using membrane preparations from transfected HN9.10 cells that constitutively expressed the delta opioid receptor.
Residue:372
BDBM50346953
NameBDBM50346953
Synonyms:CHEMBL1795713 | CHEMBL1795716
TypeSmall organic molecule
Emp. Form.C24H25IN2O4
Mol. Mass.532.3708
SMILESCN1CC[C@@]23[C@H]4Oc5c2c(C[C@@H]1[C@]3(O)CC[C@H]4NC(=O)c1cccc(I)c1)ccc5O