Reaction Details
TargetMu-type opioid receptor
LigandBDBM50346953
Substrate/Competitorn/a
Meas. Tech.ChEMBL_753173 (CHEMBL1799266)
Ki 1.8±n/a nM
Citation Majumdar, SBurgman, MHaselton, NGrinnell, SOcampo, JPasternak, ARPasternak, GW Generation of novel radiolabeled opiates through site-selective iodination. Bioorg Med Chem Lett21:4001-4 (2011) 
 
Mu-type opioid receptor
Name:Mu-type opioid receptor
Type:G Protein-Coupled Receptor (GPCR)
Mol. Mass.:44789.51
Organism:Homo sapiens (Human)
Description:P35372
Residue:400
BDBM50346953
NameBDBM50346953
Synonyms:CHEMBL1795713 | CHEMBL1795716
TypeSmall organic molecule
Emp. Form.C24H25IN2O4
Mol. Mass.532.3708
SMILESCN1CC[C@@]23[C@H]4Oc5c2c(C[C@@H]1[C@]3(O)CC[C@H]4NC(=O)c1cccc(I)c1)ccc5O