Reaction Details
TargetKappa-type opioid receptor
LigandBDBM50346950
Substrate/Competitorn/a
Meas. Tech.ChEMBL_753184 (CHEMBL1799277)
Ki 0.150000±n/a nM
Citation Majumdar, SBurgman, MHaselton, NGrinnell, SOcampo, JPasternak, ARPasternak, GW Generation of novel radiolabeled opiates through site-selective iodination. Bioorg Med Chem Lett21:4001-4 (2011) 
 
Kappa-type opioid receptor
Name:Kappa-type opioid receptor
Type:G Protein-Coupled Receptor (GPCR)
Mol. Mass.:42648.76
Organism:Homo sapiens (Human)
Description:P41145
Residue:380
BDBM50346950
NameBDBM50346950
Synonyms:CHEMBL485832
TypeSmall organic molecule
Emp. Form.C27H29N5O3
Mol. Mass.471.5509
SMILESNC(N)=Nc1ccc2[nH]c3[C@@H]4Oc5c6c(C[C@H]7N(CC8CC8)CC[C@@]46[C@@]7(O)Cc3c2c1)ccc5O