Reaction Details
TargetMu-type opioid receptor
LigandBDBM50347177
Substrate/Competitorn/a
Meas. Tech.ChEMBL_753740 (CHEMBL1799577)
Ki 0.2±n/a nM
Citation Yamamoto, NFujii, HNemoto, TNakajima, RMomen, SIzumimoto, NHasebe, KMochizuki, HNagase, H Synthesis of new opioid derivatives with a propellane skeleton and their pharmacology: part 1. Bioorg Med Chem Lett21:4104-7 (2011) 
 
Mu-type opioid receptor
Name:Mu-type opioid receptor
Type:Enzyme Catalytic Domain
Mol. Mass.:11165.58
Organism:GUINEA PIG
Description:P97266
Residue:98
BDBM50347177
NameBDBM50347177
Synonyms:CHEMBL1797687
TypeSmall organic molecule
Emp. Form.C20H29NO2
Mol. Mass.315.4498
SMILESCCC12CCN(CC3(O)CC3)[C@H](Cc3ccc(O)cc13)C2(C)C