Reaction Details
TargetCytochrome P450 3A4
LigandBDBM50347656
Substrate/Competitorn/a
Meas. Tech.ChEMBL_756007 (CHEMBL1803983)
IC50>50000±n/a nM
Citation Katz, JDJewell, JPGuerin, DJLim, JDinsmore, CJDeshmukh, SVPan, BSMarshall, CGLu, WAltman, MDDahlberg, WKDavis, LFalcone, DGabarda, AEHang, GHatch, HHolmes, RKunii, KLumb, KJLutterbach, BMathvink, RNazef, NPatel, SBQu, XReilly, JFRickert, KWRosenstein, CSoisson, SMSpencer, KBSzewczak, AAWalker, DWang, WYoung, JZeng, Q Discovery of a 5H-benzo[4,5]cyclohepta[1,2-b]pyridin-5-one (MK-2461) inhibitor of c-Met kinase for the treatment of cancer. J Med Chem54:4092-108 (2011) 
 
Cytochrome P450 3A4
Name:Cytochrome P450 3A4
Type:Enzyme
Mol. Mass.:57349.57
Organism:Homo sapiens (Human)
Description:n/a
Residue:503
BDBM50347656
NameBDBM50347656
Synonyms:CHEMBL1803004
TypeSmall organic molecule
Emp. Form.C21H16N2O3S
Mol. Mass.376.428
SMILESCS(=O)(=O)Nc1ccc2ccc3ncc(cc3c(=O)c2c1)-c1ccccc1