Reaction Details
TargetHepatocyte growth factor receptor
LigandBDBM50347696
Substrate/Competitorn/a
Meas. Tech.ChEMBL_755794 (CHEMBL1803461)
IC50 19±n/a nM
Citation Katz, JDJewell, JPGuerin, DJLim, JDinsmore, CJDeshmukh, SVPan, BSMarshall, CGLu, WAltman, MDDahlberg, WKDavis, LFalcone, DGabarda, AEHang, GHatch, HHolmes, RKunii, KLumb, KJLutterbach, BMathvink, RNazef, NPatel, SBQu, XReilly, JFRickert, KWRosenstein, CSoisson, SMSpencer, KBSzewczak, AAWalker, DWang, WYoung, JZeng, Q Discovery of a 5H-benzo[4,5]cyclohepta[1,2-b]pyridin-5-one (MK-2461) inhibitor of c-Met kinase for the treatment of cancer. J Med Chem54:4092-108 (2011) 
 
Hepatocyte growth factor receptor
Name:Hepatocyte growth factor receptor
Type:Protein
Mol. Mass.:155559.73
Organism:Homo sapiens (Human)
Description:P08581
Residue:1390
BDBM50347696
NameBDBM50347696
Synonyms:CHEMBL1802604
TypeSmall organic molecule
Emp. Form.C18H13ClN4O
Mol. Mass.336.775
SMILESCn1cc(cn1)-c1cnc2ccc3ccc(N)c(Cl)c3c(=O)c2c1