Reaction Details
TargetMitogen-activated protein kinase 14
LigandBDBM50314073
Substrate/Competitorn/a
Meas. Tech.ChEMBL_756761 (CHEMBL1805307)
IC50 2.30±n/a nM
Citation Selness, SRDevraj, RVDevadas, BWalker, JKBoehm, TLDurley, RCShieh, HXing, LRucker, PVJerome, KDBenson, AGMarrufo, LDMadsen, HMHitchcock, JOwen, TJChristie, LPromo, MAHickory, BSAlvira, ENaing, WBlevis-Bal, RMessing, DYang, JMao, MKYalamanchili, GVonder Embse, RHirsch, JSaabye, MBonar, SWebb, EAnderson, GMonahan, JB Discovery of PH-797804, a highly selective and potent inhibitor of p38 MAP kinase. Bioorg Med Chem Lett21:4066-71 (2011) 
 
Mitogen-activated protein kinase 14
Name:Mitogen-activated protein kinase 14
Type:Serine/threonine-protein kinase
Mol. Mass.:41286.76
Organism:Homo sapiens (Human)
Description:Q16539
Residue:360
BDBM50314073
NameBDBM50314073
Synonyms:3-(3-bromo-4-(2,4-difluorobenzyloxy)-6-methyl-2-oxopyridin-1(2H)-yl)-N,4-dimethylbenzamide CHEMBL1088751 PH-797804 | PHA-797804
TypeSmall organic molecule
Emp. Form.C22H19BrF2N2O3
Mol. Mass.477.299
SMILESCNC(=O)c1ccc(C)c(c1)-n1c(C)cc(OCc2ccc(F)cc2F)c(Br)c1=O