Reaction Details
TargetDihydrofolate reductase
LigandBDBM50348433
Substrate/Competitorn/a
Meas. Tech.ChEMBL_755432 (CHEMBL1804901)
IC50 7.2±n/a nM
Citation Ma, XChui, WK Antifolate and antiproliferative activity of 6,8,10-triazaspiro[4.5]deca-6,8-dienes and 1,3,5-triazaspiro[5.5]undeca-1,3-dienes. Bioorg Med Chem18:737-43 (2010) 
 
Dihydrofolate reductase
Name:Dihydrofolate reductase
Type:Enzyme
Mol. Mass.:21603.71
Organism:Bos taurus (Cattle)
Description:P00376
Residue:187
BDBM50348433
NameBDBM50348433
Synonyms:CHEMBL1800939
TypeSmall organic molecule
Emp. Form.C16H22ClN5O2
Mol. Mass.351.831
SMILESNC1=NC2(CCCC2)N(OCCCOc2ccc(Cl)cc2)C(N)=N1