Reaction Details
TargetDihydrofolate reductase
LigandBDBM50348437
Substrate/Competitorn/a
Meas. Tech.ChEMBL_755432 (CHEMBL1804901)
IC50 11.2±n/a nM
Citation Ma, XChui, WK Antifolate and antiproliferative activity of 6,8,10-triazaspiro[4.5]deca-6,8-dienes and 1,3,5-triazaspiro[5.5]undeca-1,3-dienes. Bioorg Med Chem18:737-43 (2010) 
 
Dihydrofolate reductase
Name:Dihydrofolate reductase
Type:Enzyme
Mol. Mass.:21603.71
Organism:Bos taurus (Cattle)
Description:P00376
Residue:187
BDBM50348437
NameBDBM50348437
Synonyms:CHEMBL1800943
TypeSmall organic molecule
Emp. Form.C17H25N5O3
Mol. Mass.347.4121
SMILESCOc1ccc(OCCCON2C(N)=NC(N)=NC22CCCC2)cc1