Reaction Details
TargetDihydrofolate reductase
LigandBDBM50348446
Substrate/Competitorn/a
Meas. Tech.ChEMBL_755432 (CHEMBL1804901)
IC50 6.1±n/a nM
Citation Ma, XChui, WK Antifolate and antiproliferative activity of 6,8,10-triazaspiro[4.5]deca-6,8-dienes and 1,3,5-triazaspiro[5.5]undeca-1,3-dienes. Bioorg Med Chem18:737-43 (2010) 
 
Dihydrofolate reductase
Name:Dihydrofolate reductase
Type:Enzyme
Mol. Mass.:21603.71
Organism:Bos taurus (Cattle)
Description:P00376
Residue:187
BDBM50348446
NameBDBM50348446
Synonyms:CHEMBL1801200
TypeSmall organic molecule
Emp. Form.C18H27N5O3
Mol. Mass.361.4387
SMILESCOc1ccc(OCCCON2C(N)=NC(N)=NC22CCCCC2)cc1