Reaction Details
TargetDNA topoisomerase 1
LigandBDBM50378912
Substrate/Competitorn/a
Meas. Tech.ChEMBL_760771 (CHEMBL1815756)
Kd 2.65±n/a nM
Citation Lauro, GRomano, ARiccio, RBifulco, G Inverse virtual screening of antitumor targets: pilot study on a small database of natural bioactive compounds. J Nat Prod74:1401-7 (2011) 
 
DNA topoisomerase 1
Name:DNA topoisomerase 1
Type:Enzyme
Mol. Mass.:90771.02
Organism:Homo sapiens (Human)
Description:P11387
Residue:765
BDBM50378912
NameBDBM50378912
Synonyms:CHEMBL1813809
TypeSmall organic molecule
Emp. Form.C24H23N3O6
Mol. Mass.449.4559
SMILESCC[C@@]1(O)C(=O)OCc2c1cc1-c3nc4ccccc4c(\C=N/OCCCO)c3Cn1c2=O