Reaction Details
TargetTryptophan 2,3-dioxygenase
LigandBDBM50350248
Substrate/Competitorn/a
Meas. Tech.ChEMBL_761930 (CHEMBL1817449)
Ki 5600±n/a nM
Citation Dolusic, ELarrieu, PMoineaux, LStroobant, VPilotte, LColau, DPochet, LVan den Eynde, BMasereel, BWouters, JFrédérick, R Tryptophan 2,3-dioxygenase (TDO) inhibitors. 3-(2-(pyridyl)ethenyl)indoles as potential anticancer immunomodulators. J Med Chem54:5320-34 (2011) 
 
Tryptophan 2,3-dioxygenase
Name:Tryptophan 2,3-dioxygenase
Type:PROTEIN
Mol. Mass.:47874.48
Organism:Homo sapiens (Human)
Description:ChEMBL_825691
Residue:406
BDBM50350248
NameBDBM50350248
Synonyms:CHEMBL1812545
TypeSmall organic molecule
Emp. Form.C11H8FN5
Mol. Mass.229.2131
SMILESFc1ccc2c(C=Cc3nnn[nH]3)c[nH]c2c1