Reaction Details
TargetBeta-1 adrenergic receptor
LigandBDBM25753
Substrate/Competitorn/a
Meas. Tech.ChEMBL_761938 (CHEMBL1817457)
Ki 170±n/a nM
Citation Dolusic, ELarrieu, PMoineaux, LStroobant, VPilotte, LColau, DPochet, LVan den Eynde, BMasereel, BWouters, JFrédérick, R Tryptophan 2,3-dioxygenase (TDO) inhibitors. 3-(2-(pyridyl)ethenyl)indoles as potential anticancer immunomodulators. J Med Chem54:5320-34 (2011) 
 
Beta-1 adrenergic receptor
Name:Beta-1 adrenergic receptor
Type:G Protein-Coupled Receptor (GPCR)
Mol. Mass.:51338.40
Organism:Homo sapiens (Human)
Description:P08588
Residue:477
BDBM25753
NameBDBM25753
Synonyms:2-{4-[2-hydroxy-3-(propan-2-ylamino)propoxy]phenyl}acetamide Atenolol Tenormin | Tenormine
TypeSmall organic molecule
Emp. Form.C14H22N2O3
Mol. Mass.266.3361
SMILESCC(C)NCC(O)COc1ccc(CC(N)=O)cc1